BDBM50103971 CHEMBL3593897
SMILES CN(C)c1ccc(\C=C2/C(=O)N(c3ccccc23)c2ccncc2)cc1
InChI Key InChIKey=HWVXPGHGJNHQJM-HKWRFOASSA-N
Data  3 KI
  Tab Delimited (TSV)   2D SDfile   Computed 3D by Vconf -m prep SDfile
Find this compound or compounds like it in BindingDB:
Activity Spreadsheet -- Enzyme Inhibition Constant Data from BindingDB
Found 3 hits for monomerid = 50103971
TargetAmyloid-beta precursor protein(Homo sapiens (Human))
Washington University
Curated by ChEMBL
LigandPNGBDBM50103971(CHEMBL3593897)
Affinity DataKi:  87nM. Assay description: Displacement of Thio-T from amyloid beta (1 to 42) (unknown origin) expressed in Escherichia coli after 1.5 hrs by fluorescence assay
In DepthDetails ArticlePubMed
TargetAlpha-synuclein(Homo sapiens (Human))
Washington University
Curated by ChEMBL
LigandPNGBDBM50103971(CHEMBL3593897)
Affinity DataKi:  150nM. Assay description: Displacement of Thio-T from recombinant alpha-synuclein (unknown origin) expressed in Escherichia coli after 1.5 hrs by fluorescence assay
In DepthDetails ArticlePubMed
TargetMicrotubule-associated protein tau(Homo sapiens (Human))
Washington University
Curated by ChEMBL
LigandPNGBDBM50103971(CHEMBL3593897)
Affinity DataKi:  364nM. Assay description: Displacement of Thio-T from human recombinant tau (243 to 375) expressed in Escherichia coli BL21(DE3)RIL after 1.5 hrs by fluorescence assay
In DepthDetails ArticlePubMed