BDBM50103991 4-Benzylsulfanyl-N-hydroxy-2-((4-methoxy-benzenesulfonyl)-{[(pyridin-3-ylmethyl)-carbamoyl]-methyl}-amino)-butyramide::CHEMBL106016
SMILES COc1ccc(cc1)S(=O)(=O)N(CC(=O)NCc1cccnc1)C(CCSCc1ccccc1)C(=O)NO
InChI Key InChIKey=MMOBDSFVSOBMOV-UHFFFAOYSA-N
Data  5 IC50
  Tab Delimited (TSV)   2D SDfile   Computed 3D by Vconf -m prep SDfile
Find this compound or compounds like it in BindingDB:
Activity Spreadsheet -- Enzyme Inhibition Constant Data from BindingDB
Found 5 hits for monomerid = 50103991
TargetMatrix metalloproteinase-9(Homo sapiens (Human))
Université
Curated by ChEMBL
LigandPNGBDBM50103991(4-Benzylsulfanyl-N-hydroxy-2-((4-methoxy-benzenesu...)
Affinity DataIC50:  0.200nM. Assay description: In vitro inhibition of human matrix metalloprotease-9
In DepthDetails ArticlePubMed
TargetCollagenase 3(Homo sapiens (Human))
Université
Curated by ChEMBL
LigandPNGBDBM50103991(4-Benzylsulfanyl-N-hydroxy-2-((4-methoxy-benzenesu...)
Affinity DataIC50:  1.10nM. Assay description: In vitro inhibition of human matrix metalloprotease-13
In DepthDetails ArticlePubMed
Target72 kDa type IV collagenase(Homo sapiens (Human))
Université
Curated by ChEMBL
LigandPNGBDBM50103991(4-Benzylsulfanyl-N-hydroxy-2-((4-methoxy-benzenesu...)
Affinity DataIC50:  1.20nM. Assay description: In vitro inhibition of human matrix metalloprotease-2
In DepthDetails ArticlePubMed
TargetInterstitial collagenase(Homo sapiens (Human))
Université
Curated by ChEMBL
LigandPNGBDBM50103991(4-Benzylsulfanyl-N-hydroxy-2-((4-methoxy-benzenesu...)
Affinity DataIC50:  20nM. Assay description: In vitro inhibition of human matrix metalloprotease-1
In DepthDetails ArticlePubMed
TargetStromelysin-1(Homo sapiens (Human))
Université
Curated by ChEMBL
LigandPNGBDBM50103991(4-Benzylsulfanyl-N-hydroxy-2-((4-methoxy-benzenesu...)
Affinity DataIC50:  2.20nM. Assay description: In vitro inhibitory activity against matrix metalloprotease-3
In DepthDetails ArticlePubMed