BDBM50104350 4-[2-(4-Chloro-phenyl)-5-(4-fluoro-phenyl)-3H-imidazol-4-yl]-3-methyl-pyridine::CHEMBL84759
SMILES Cc1cnccc1-c1nc([nH]c1-c1ccc(F)cc1)-c1ccc(Cl)cc1
InChI Key InChIKey=KOCYTHSBSWIFSD-UHFFFAOYSA-N
Data  3 IC50
  Tab Delimited (TSV)   2D SDfile   Computed 3D by Vconf -m prep SDfile
Find this compound or compounds like it in BindingDB:
Activity Spreadsheet -- Enzyme Inhibition Constant Data from BindingDB
Found 3 hits for monomerid = 50104350
TargetGlucagon receptor(Homo sapiens (Human))
Merck Research Laboratories
Curated by ChEMBL
LigandPNGBDBM50104350(4-[2-(4-Chloro-phenyl)-5-(4-fluoro-phenyl)-3H-imid...)
Affinity DataIC50:  1.10E+3nM. Assay description: Binding affinity towards human glucagon receptor in absence of Mg2+ expressed as IC50
In DepthDetails ArticlePubMed
TargetMitogen-activated protein kinase 11/12/13/14(Homo sapiens (Human))
Merck Research Laboratories
Curated by ChEMBL
LigandPNGBDBM50104350(4-[2-(4-Chloro-phenyl)-5-(4-fluoro-phenyl)-3H-imid...)
Affinity DataIC50:  20nM. Assay description: Binding affinity towards human glucagon receptor in absence of Mg2+ expressed as IC50
In DepthDetails ArticlePubMed
TargetGlucagon receptor(Homo sapiens (Human))
Merck Research Laboratories
Curated by ChEMBL
LigandPNGBDBM50104350(4-[2-(4-Chloro-phenyl)-5-(4-fluoro-phenyl)-3H-imid...)
Affinity DataIC50:  20nM. Assay description: Inhibition of human glucagon receptor expressed in CHO cell membranes by radioligand displacement assay
In DepthDetails Article