BDBM50104355 4-[4-(4-Fluoro-phenyl)-5-pyridin-4-yl-1H-imidazol-2-yl]-benzoic acid methyl ester::CHEMBL17722
SMILES COC(=O)c1ccc(cc1)-c1nc(c([nH]1)-c1ccc(F)cc1)-c1ccncc1
InChI Key InChIKey=GUZODAKISVJZOY-UHFFFAOYSA-N
Data  5 IC50
  Tab Delimited (TSV)   2D SDfile   Computed 3D by Vconf -m prep SDfile
Find this compound or compounds like it in BindingDB:
Activity Spreadsheet -- Enzyme Inhibition Constant Data from BindingDB
Found 5 hits for monomerid = 50104355
TargetGlucagon receptor(Homo sapiens (Human))
Merck Research Laboratories
Curated by ChEMBL
LigandPNGBDBM50104355(4-[4-(4-Fluoro-phenyl)-5-pyridin-4-yl-1H-imidazol-...)
Affinity DataIC50:  8.70E+3nM. Assay description: Binding affinity towards human glucagon receptor in absence of Mg2+ expressed as IC50
In DepthDetails ArticlePubMed
TargetPolyunsaturated fatty acid 5-lipoxygenase(Rattus norvegicus)
TBA
Curated by ChEMBL
LigandPNGBDBM50104355(4-[4-(4-Fluoro-phenyl)-5-pyridin-4-yl-1H-imidazol-...)
Affinity DataIC50:  5.30E+3nM. Assay description: Inhibitory activity against 5-lipoxygenase enzyme from RBL-1 cells
In DepthDetails Article
TargetMitogen-activated protein kinase 11/12/13/14(Homo sapiens (Human))
Merck Research Laboratories
Curated by ChEMBL
LigandPNGBDBM50104355(4-[4-(4-Fluoro-phenyl)-5-pyridin-4-yl-1H-imidazol-...)
Affinity DataIC50:  300nM. Assay description: Binding affinity towards human Mitogen-activated protein kinase p38 expressed as IC50
In DepthDetails ArticlePubMed
TargetPolyunsaturated fatty acid 5-lipoxygenase(Homo sapiens (Human))
TBA
Curated by ChEMBL
LigandPNGBDBM50104355(4-[4-(4-Fluoro-phenyl)-5-pyridin-4-yl-1H-imidazol-...)
Affinity DataIC50:  370nM. Assay description: Inhibitory activity against interleukin-1(IL-1) synthesis, using intact human monocytes
In DepthDetails Article
TargetGlucagon receptor(Homo sapiens (Human))
Merck Research Laboratories
Curated by ChEMBL
LigandPNGBDBM50104355(4-[4-(4-Fluoro-phenyl)-5-pyridin-4-yl-1H-imidazol-...)
Affinity DataIC50:  301nM. Assay description: Inhibition of human glucagon receptor expressed in CHO cell membranes by radioligand displacement assay
In DepthDetails Article