BDBM50104359 4-[5-(4-Fluoro-phenyl)-2-(4-iodo-phenyl)-3H-imidazol-4-yl]-pyridine::CHEMBL314181
SMILES Fc1ccc(cc1)-c1[nH]c(nc1-c1ccncc1)-c1ccc(I)cc1
InChI Key InChIKey=SZXJKSQEKRRTMT-UHFFFAOYSA-N
Data  3 IC50
  Tab Delimited (TSV)   2D SDfile   Computed 3D by Vconf -m prep SDfile
Find this compound or compounds like it in BindingDB:
Activity Spreadsheet -- Enzyme Inhibition Constant Data from BindingDB
Found 3 hits for monomerid = 50104359
TargetGlucagon receptor(Homo sapiens (Human))
Merck Research Laboratories
Curated by ChEMBL
LigandPNGBDBM50104359(4-[5-(4-Fluoro-phenyl)-2-(4-iodo-phenyl)-3H-imidaz...)
Affinity DataIC50:  510nM. Assay description: Binding affinity towards human glucagon receptor in absence of Mg2+ expressed as IC50
In DepthDetails ArticlePubMed
TargetMitogen-activated protein kinase 11/12/13/14(Homo sapiens (Human))
Merck Research Laboratories
Curated by ChEMBL
LigandPNGBDBM50104359(4-[5-(4-Fluoro-phenyl)-2-(4-iodo-phenyl)-3H-imidaz...)
Affinity DataIC50:  100nM. Assay description: Affinity for human glucagon receptor in presence of Mg2+
In DepthDetails ArticlePubMed
TargetGlucagon receptor(Homo sapiens (Human))
Merck Research Laboratories
Curated by ChEMBL
LigandPNGBDBM50104359(4-[5-(4-Fluoro-phenyl)-2-(4-iodo-phenyl)-3H-imidaz...)
Affinity DataIC50:  100nM. Assay description: Inhibition of human glucagon receptor expressed in CHO cell membranes by radioligand displacement assay
In DepthDetails Article