BDBM50104382 4-[2-(4-Bromo-phenyl)-5-phenyl-3H-imidazol-4-yl]-pyridine::CHEMBL312928
SMILES Brc1ccc(cc1)-c1nc(c([nH]1)-c1ccccc1)-c1ccncc1
InChI Key InChIKey=QUKMNFBZSMFVFB-UHFFFAOYSA-N
Data  3 IC50
  Tab Delimited (TSV)   2D SDfile   Computed 3D by Vconf -m prep SDfile
Find this compound or compounds like it in BindingDB:
Activity Spreadsheet -- Enzyme Inhibition Constant Data from BindingDB
Found 3 hits for monomerid = 50104382
TargetGlucagon receptor(Homo sapiens (Human))
Merck Research Laboratories
Curated by ChEMBL
LigandPNGBDBM50104382(4-[2-(4-Bromo-phenyl)-5-phenyl-3H-imidazol-4-yl]-p...)
Affinity DataIC50:  782nM. Assay description: Binding affinity towards human glucagon receptor in absence of Mg2+ expressed as IC50
In DepthDetails ArticlePubMed
TargetMitogen-activated protein kinase 11/12/13/14(Homo sapiens (Human))
Merck Research Laboratories
Curated by ChEMBL
LigandPNGBDBM50104382(4-[2-(4-Bromo-phenyl)-5-phenyl-3H-imidazol-4-yl]-p...)
Affinity DataIC50:  40nM. Assay description: Binding affinity towards human glucagon receptor in absence of Mg2+ expressed as IC50
In DepthDetails ArticlePubMed
TargetGlucagon receptor(Homo sapiens (Human))
Merck Research Laboratories
Curated by ChEMBL
LigandPNGBDBM50104382(4-[2-(4-Bromo-phenyl)-5-phenyl-3H-imidazol-4-yl]-p...)
Affinity DataIC50:  40nM. Assay description: Inhibition of human glucagon receptor expressed in CHO cell membranes by radioligand displacement assay
In DepthDetails Article