BDBM50104805 CHEMBL3597504
SMILES [H][C@]1(NC(=O)[C@@H](C\C=C\C[C@H](NC(=O)[C@H](CC(C)C)NC1=O)C(=O)N[C@@H](CCCNC(N)=N)C(=O)NC(CC(C)(C)C)C(=O)N[C@@H](CC(C)C)C(=O)N[C@@H](CCC(N)=O)C(N)=O)NC(=O)[C@@H](N)CCCNC(N)=N)[C@@H](C)CC
InChI Key InChIKey=VXDVYASTWWKZSA-PNYLNTMJSA-N
Data  1 IC50
  Tab Delimited (TSV)   2D SDfile   Computed 3D by Vconf -m prep SDfile
Find this compound or compounds like it in BindingDB:
Activity Spreadsheet -- Enzyme Inhibition Constant Data from BindingDB
Found 1 hit for monomerid = 50104805
TargetEstrogen receptor(Homo sapiens (Human))
National Institute Of Health Sciences
Curated by ChEMBL
LigandPNGBDBM50104805(CHEMBL3597504)
Affinity DataIC50:  390nM. Assay description: Inhibition of estrogen receptor alpha (unknown origin)-SRC1 coactivator interaction incubated for 1 hr by receptor cofactor assay system based method
In DepthDetails ArticlePubMed