BDBM50104999 CHEMBL114683::Thiophene-2-sulfonic acid {6-[2-(5-bromo-pyrimidin-2-yloxy)-ethoxy]-5-p-tolyl-pyrimidin-4-yl}-amide
SMILES Cc1ccc(cc1)-c1c(NS(=O)(=O)c2cccs2)ncnc1OCCOc1ncc(Br)cn1
InChI Key InChIKey=URTNSLRZPSFZHX-UHFFFAOYSA-N
Data  1 IC50
  Tab Delimited (TSV)   2D SDfile   Computed 3D by Vconf -m prep SDfile
Find this compound or compounds like it in BindingDB:
Activity Spreadsheet -- Enzyme Inhibition Constant Data from BindingDB
Found 1 hit for monomerid = 50104999
TargetEndothelin-1 receptor(Sus scrofa)
Tanabe Seiyaku
Curated by ChEMBL
LigandPNGBDBM50104999(CHEMBL114683 | Thiophene-2-sulfonic acid {6-[2-(5-...)
Affinity DataIC50:  3.10nM. Assay description: In vitro inhibition of [125I]-ET-1 binding to Endothelin A receptor in porcine aortic membrane from endothelial cells
In DepthDetails ArticlePubMed