BDBM50105957 4-{N'-[3-Amino-1-(4-tert-butyl-phenyl)-5-oxo-1,5-dihydro-pyrazol-4-ylidene]-hydrazino}-3-hydroxy-naphthalene-1-sulfonic acid::CHEMBL122535
SMILES CC(C)(C)c1ccc(cc1)-n1[nH]c(N)c(N=Nc2c(O)cc(c3ccccc23)S(O)(=O)=O)c1=O
InChI Key InChIKey=SJVWYAVTWVXNDB-UHFFFAOYSA-N
Data  1 EC50
  Tab Delimited (TSV)   2D SDfile   Computed 3D by Vconf -m prep SDfile
Find this compound or compounds like it in BindingDB:
Activity Spreadsheet -- Enzyme Inhibition Constant Data from BindingDB
Found 1 hit for monomerid = 50105957
TargetThrombopoietin receptor(Homo sapiens (Human))
Glaxosmithkline
Curated by ChEMBL
LigandPNGBDBM50105957(4-{N'-[3-Amino-1-(4-tert-butyl-phenyl)-5-oxo-1,5-d...)
Affinity DataEC50:  5.00E+3nM. Assay description: Effective concentration for thrombopoietin luciferase activity was determined in BAF-3 cells
In DepthDetails ArticlePubMed