BDBM50106208 CHEMBL3598101
SMILES CS(=O)(=O)c1cnc(O[C@H]2CC[C@@H](CC2)OC2CCN(CC2)C(=O)OC(C(F)(F)F)C(F)(F)F)cn1
InChI Key InChIKey=UELPEIDTYUYPHA-JOCQHMNTSA-N
Data  3 EC50
  Tab Delimited (TSV)   2D SDfile   Computed 3D by Vconf -m prep SDfile
Find this compound or compounds like it in BindingDB:
Activity Spreadsheet -- Enzyme Inhibition Constant Data from BindingDB
Found 3 hits for monomerid = 50106208
TargetGlucose-dependent insulinotropic receptor(Homo sapiens (Human))
Arena Pharmaceuticals
Curated by ChEMBL
LigandPNGBDBM50106208(CHEMBL3598101)
Affinity DataEC50:  1.20nM. Assay description: Agonist activity at human GPR119 by HTRF cAMP assay
In DepthDetails ArticlePubMed
TargetGlucose-dependent insulinotropic receptor(Rattus norvegicus)
Arena Pharmaceuticals
Curated by ChEMBL
LigandPNGBDBM50106208(CHEMBL3598101)
Affinity DataEC50:  11nM. Assay description: Agonist activity at rat GPR119 by HTRF cAMP assay
In DepthDetails ArticlePubMed
TargetGlucose-dependent insulinotropic receptor(Homo sapiens (Human))
Arena Pharmaceuticals
Curated by ChEMBL
LigandPNGBDBM50106208(CHEMBL3598101)
Affinity DataEC50:  45nM. Assay description: Agonist activity at human GPR119 by serum shift assay
In DepthDetails ArticlePubMed