BDBM50107128 5-Chloro-N-[2-chloro-5-(4-chloro-benzenesulfonyl)-phenyl]-2-hydroxy-3-methyl-benzamide::CHEMBL334590
SMILES Cc1cc(Cl)cc(C(=O)Nc2cc(ccc2Cl)S(=O)(=O)c2ccc(Cl)cc2)c1O
InChI Key InChIKey=ZQRCPFSOUWSKRS-UHFFFAOYSA-N
Data  1 IC50
  Tab Delimited (TSV)   2D SDfile   Computed 3D by Vconf -m prep SDfile
Find this compound or compounds like it in BindingDB:
Activity Spreadsheet -- Enzyme Inhibition Constant Data from BindingDB
Found 1 hit for monomerid = 50107128
TargetApoptosis regulator Bcl-2(Homo sapiens (Human))
Georgetown University Medical Center
Curated by ChEMBL
LigandPNGBDBM50107128(5-Chloro-N-[2-chloro-5-(4-chloro-benzenesulfonyl)-...)
Affinity DataIC50:  3.30E+3nM. Assay description: Inhibitory activity against Bcl-2
In DepthDetails ArticlePubMed