BDBM50107131 2-Amino-6-bromo-4-(cyano-ethoxycarbonyl-methyl)-chroman-3-carboxylic acid ethyl ester::CHEMBL137135
SMILES CCOC(=O)C(C#N)C1C(C(N)Oc2ccc(Br)cc12)C(=O)OCC
InChI Key InChIKey=AKOLMGYGGXYTGK-UHFFFAOYSA-N
Data  1 IC50
  Tab Delimited (TSV)   2D SDfile   Computed 3D by Vconf -m prep SDfile
Find this compound or compounds like it in BindingDB:
Activity Spreadsheet -- Enzyme Inhibition Constant Data from BindingDB
Found 1 hit for monomerid = 50107131
TargetApoptosis regulator Bcl-2(Homo sapiens (Human))
Georgetown University Medical Center
Curated by ChEMBL
LigandPNGBDBM50107131(2-Amino-6-bromo-4-(cyano-ethoxycarbonyl-methyl)-ch...)
Affinity DataIC50:  9.00E+3nM. Assay description: Inhibitory activity against Bcl-2
In DepthDetails ArticlePubMed