BDBM50107736 CHEMBL3600816
SMILES CN(CCc1ccc(CN2CCC(CC2)NC(C)=O)cc1)C(=O)c1ccc(cc1)-c1ccc(F)cc1
InChI Key InChIKey=MGORRVRDTUOGIX-UHFFFAOYSA-N
Data  4 IC50
  Tab Delimited (TSV)   2D SDfile   Computed 3D by Vconf -m prep SDfile
Find this compound or compounds like it in BindingDB:
Activity Spreadsheet -- Enzyme Inhibition Constant Data from BindingDB
Found 4 hits for monomerid = 50107736
Target5-hydroxytryptamine receptor 2A(Homo sapiens (Human))
Boehringer Ingelheim Pharma
Curated by ChEMBL
LigandPNGBDBM50107736(CHEMBL3600816)
Affinity DataIC50: >1.00E+4nM. Assay description: Inhibition of 5HT2A receptor (unknown origin)
In DepthDetails ArticlePubMed
TargetMelanin-concentrating hormone receptor 1(Homo sapiens (Human))
Boehringer Ingelheim Pharma
Curated by ChEMBL
LigandPNGBDBM50107736(CHEMBL3600816)
Affinity DataIC50:  11nM. Assay description: Displacement of [125I]-MCH from human MCHR1 expressed in CHO/Galpha16 cell membranes by scintillation counting method
In DepthDetails ArticlePubMed
TargetMuscarinic acetylcholine receptor M1(Homo sapiens (Human))
Boehringer Ingelheim Pharma
Curated by ChEMBL
LigandPNGBDBM50107736(CHEMBL3600816)
Affinity DataIC50: >1.00E+4nM. Assay description: Inhibition of muscarinic M1 receptor (unknown origin)
In DepthDetails ArticlePubMed
TargetCytochrome P450 2D6(Homo sapiens (Human))
Boehringer Ingelheim Pharma
Curated by ChEMBL
LigandPNGBDBM50107736(CHEMBL3600816)
Affinity DataIC50:  1.50E+4nM. Assay description: Inhibition of CYP2D6 receptor (unknown origin)
In DepthDetails ArticlePubMed