BDBM50107758 CHEMBL3601024
SMILES CCN(CC)CCOc1ccc(cc1)C(=O)N(C)c1ccc(cc1)-c1ccc(OC)cc1
InChI Key InChIKey=XWDNUXWNKPXBGG-UHFFFAOYSA-N
Data  1 IC50
  Tab Delimited (TSV)   2D SDfile   Computed 3D by Vconf -m prep SDfile
Find this compound or compounds like it in BindingDB:
Activity Spreadsheet -- Enzyme Inhibition Constant Data from BindingDB
Found 1 hit for monomerid = 50107758
TargetMelanin-concentrating hormone receptor 1(Homo sapiens (Human))
Boehringer Ingelheim Pharma
Curated by ChEMBL
LigandPNGBDBM50107758(CHEMBL3601024)
Affinity DataIC50:  251nM. Assay description: Displacement of [125I]-MCH from human MCHR1 expressed in CHO/Galpha16 cell membranes by scintillation counting method
In DepthDetails ArticlePubMed