BDBM50107769 4'-Trifluoromethyl-biphenyl-2-carboxylic acid (2-methanesulfonylamino-indan-5-yl)-amide::CHEMBL140786
SMILES CS(=O)(=O)NC1Cc2ccc(NC(=O)c3ccccc3-c3ccc(cc3)C(F)(F)F)cc2C1
InChI Key InChIKey=KKNFPZSPEHSKQU-UHFFFAOYSA-N
Data  2 IC50
  Tab Delimited (TSV)   2D SDfile   Computed 3D by Vconf -m prep SDfile
Find this compound or compounds like it in BindingDB:
Activity Spreadsheet -- Enzyme Inhibition Constant Data from BindingDB
Found 2 hits for monomerid = 50107769
TargetMicrosomal triglyceride transfer protein large subunit(Homo sapiens (Human))
Novartis Institute For Biomedical Reasearch
Curated by ChEMBL
LigandPNGBDBM50107769(4'-Trifluoromethyl-biphenyl-2-carboxylic acid (2-m...)
Affinity DataIC50:  120nM. Assay description: In vitro inhibitory activity against MTP using MTP transfer assay
In DepthDetails ArticlePubMed
TargetApolipoprotein B-100(Homo sapiens (Human))
Novartis Institute For Biomedical Reasearch
Curated by ChEMBL
LigandPNGBDBM50107769(4'-Trifluoromethyl-biphenyl-2-carboxylic acid (2-m...)
Affinity DataIC50:  60nM. Assay description: Inhibition of apolipoprotein B (apoB) secreted by human hepatoma cells (Hep G2) at 100 nM
In DepthDetails ArticlePubMed