BDBM50107792 4'-Chloro-6-methyl-biphenyl-2-carboxylic acid (2-benzenesulfonylamino-indan-5-yl)-amide::CHEMBL140754
SMILES Cc1cccc(C(=O)Nc2ccc3CC(Cc3c2)NS(=O)(=O)c2ccccc2)c1-c1ccc(Cl)cc1
InChI Key InChIKey=KAVUYBYDHINKNE-UHFFFAOYSA-N
Data  2 IC50
  Tab Delimited (TSV)   2D SDfile   Computed 3D by Vconf -m prep SDfile
Find this compound or compounds like it in BindingDB:
Activity Spreadsheet -- Enzyme Inhibition Constant Data from BindingDB
Found 2 hits for monomerid = 50107792
TargetMicrosomal triglyceride transfer protein large subunit(Homo sapiens (Human))
Novartis Institute For Biomedical Reasearch
Curated by ChEMBL
LigandPNGBDBM50107792(4'-Chloro-6-methyl-biphenyl-2-carboxylic acid (2-b...)
Affinity DataIC50:  100nM. Assay description: In vitro inhibitory activity against MTP using MTP transfer assay
In DepthDetails ArticlePubMed
TargetApolipoprotein B-100(Homo sapiens (Human))
Novartis Institute For Biomedical Reasearch
Curated by ChEMBL
LigandPNGBDBM50107792(4'-Chloro-6-methyl-biphenyl-2-carboxylic acid (2-b...)
Affinity DataIC50:  2.40nM. Assay description: Inhibition of apolipoprotein B (apoB) secreted by human hepatoma cells (Hep G2) at 100 nM
In DepthDetails ArticlePubMed