BDBM50107837 CHEMBL3601013
SMILES Clc1ccc(cc1)-c1ccc(nc1)C#Cc1ccc(OCCN2CCCC2)nc1
InChI Key InChIKey=RHXDZQVXANGHQR-UHFFFAOYSA-N
Data  1 IC50
  Tab Delimited (TSV)   2D SDfile   Computed 3D by Vconf -m prep SDfile
Find this compound or compounds like it in BindingDB:
Activity Spreadsheet -- Enzyme Inhibition Constant Data from BindingDB
Found 1 hit for monomerid = 50107837
TargetMelanin-concentrating hormone receptor 1(Homo sapiens (Human))
Boehringer Ingelheim Pharma
Curated by ChEMBL
LigandPNGBDBM50107837(CHEMBL3601013)
Affinity DataIC50:  6nM. Assay description: Displacement of [125I]-MCH from human MCHR1 expressed in CHO/Galpha16 cell membranes by scintillation counting method
In DepthDetails ArticlePubMed