BDBM50109044 CHEMBL3600721
SMILES C[C@@H]1CN(CC(=O)N2CCCC2)CCN1
InChI Key InChIKey=FZALEHHAYIXXFT-SNVBAGLBSA-N
Data  1 IC50
  Tab Delimited (TSV)   2D SDfile   Computed 3D by Vconf -m prep SDfile
Find this compound or compounds like it in BindingDB:
Activity Spreadsheet -- Enzyme Inhibition Constant Data from BindingDB
Found 1 hit for monomerid = 50109044
TargetBaculoviral IAP repeat-containing protein 2(Homo sapiens (Human))
Astex Pharmaceuticals
Curated by ChEMBL
LigandPNGBDBM50109044(CHEMBL3600721)
Affinity DataIC50:  4.10E+5nM. Assay description: Antagonist activity at cIAP1-BIR3 domain (unknown origin) assessed as inhibition of interaction with SMAC by fluorescence polarization assay
In DepthDetails ArticlePubMed