BDBM50109322 CHEMBL114761::[4-(4-Fluoro-phenyl)-2,6-diisopropyl-5-(2-methyl-propenyl)-pyridin-3-yl]-methanol
SMILES [#6]-[#6](-[#6])-c1nc(-[#6](-[#6])-[#6])c(\[#6]=[#6](\[#6])-[#6])c(-c2ccc(F)cc2)c1-[#6]-[#8]
InChI Key InChIKey=GVBJJKSOKACDSI-UHFFFAOYSA-N
Data  3 IC50
  Tab Delimited (TSV)   2D SDfile   Computed 3D by Vconf -m prep SDfile
Find this compound or compounds like it in BindingDB:
Activity Spreadsheet -- Enzyme Inhibition Constant Data from BindingDB
Found 3 hits for monomerid = 50109322
TargetGlucagon receptor(Homo sapiens (Human))
Bayer Research Center
Curated by ChEMBL
LigandPNGBDBM50109322(CHEMBL114761 | [4-(4-Fluoro-phenyl)-2,6-diisopropy...)
Affinity DataIC50:  7.00E+3nM. Assay description: Inhibitory concentration against binding to the human glucagon receptor (hGR)
In DepthDetails ArticlePubMed
TargetGlucagon receptor(Homo sapiens (Human))
Bayer Research Center
Curated by ChEMBL
LigandPNGBDBM50109322(CHEMBL114761 | [4-(4-Fluoro-phenyl)-2,6-diisopropy...)
Affinity DataIC50:  7.00E+3nM. Assay description: Binding affinity of the compound against human glucagon receptor was determined
In DepthDetails ArticlePubMed
TargetGlucagon receptor(Homo sapiens (Human))
Bayer Research Center
Curated by ChEMBL
LigandPNGBDBM50109322(CHEMBL114761 | [4-(4-Fluoro-phenyl)-2,6-diisopropy...)
Affinity DataIC50:  2.00E+3nM. Assay description: Inhibitory concentration of the compound against cAMP production in hGR-CHO cells
In DepthDetails ArticlePubMed