BDBM50109442 4-(3-(8-butyl-2-(furan-2-yl)-8H-pyrazolo[4,3-e][1,2,4]triazolo[1,5-c]pyrimidin-5-yl)ureido)benzenesulfonic acid::4-[3-(8-Butyl-2-furan-2-yl-8H-pyrazolo[4,3-e][1,2,4]triazolo[1,5-c]pyrimidin-5-yl)-ureido]-benzenesulfonic acid::CHEMBL164904
SMILES CCCCn1cc2c(n1)nc(NC(=O)Nc1ccc(cc1)S(O)(=O)=O)n1nc(nc21)-c1ccco1
InChI Key InChIKey=CUKROFJHIKPBQG-UHFFFAOYSA-N
Data  6 KI
  Tab Delimited (TSV)   2D SDfile   Computed 3D by Vconf -m prep SDfile
Find this compound or compounds like it in BindingDB:
Activity Spreadsheet -- Enzyme Inhibition Constant Data from BindingDB
Found 6 hits for monomerid = 50109442
TargetAdenosine receptor A3(Homo sapiens (Human))
Universit£
Curated by ChEMBL
LigandPNGBDBM50109442(4-(3-(8-butyl-2-(furan-2-yl)-8H-pyrazolo[4,3-e][1,...)
Affinity DataKi:  47nM. Assay description: Displacement of [3H]NECA from human adenosine A3 receptor expressed in CHO cellsChecked by Author
In DepthDetails ArticlePubMed
TargetAdenosine receptor A3(Homo sapiens (Human))
Universit£
Curated by ChEMBL
LigandPNGBDBM50109442(4-(3-(8-butyl-2-(furan-2-yl)-8H-pyrazolo[4,3-e][1,...)
Affinity DataKi:  47nM. Assay description: Displacement of specific [3H]-MRE3008-F20 binding at human Adenosine A3 receptor expressed in HEK cells; value ranges from 39-55
In DepthDetails ArticlePubMed
TargetAdenosine receptor A2a(Homo sapiens (Human))
Universit£
Curated by ChEMBL
LigandPNGBDBM50109442(4-(3-(8-butyl-2-(furan-2-yl)-8H-pyrazolo[4,3-e][1,...)
Affinity DataKi:  352nM. Assay description: Displacement of [3H]NECA from human adenosine A2A receptor expressed in CHO cellsChecked by Author
In DepthDetails ArticlePubMed
TargetAdenosine receptor A2a(Homo sapiens (Human))
Universit£
Curated by ChEMBL
LigandPNGBDBM50109442(4-(3-(8-butyl-2-(furan-2-yl)-8H-pyrazolo[4,3-e][1,...)
Affinity DataKi:  352nM. Assay description: Displacement of [3H]-SCH-58,261 from human Adenosine A2A receptor expressed in HEK-293 cells; range 300-414
In DepthDetails ArticlePubMed
TargetAdenosine receptor A1(Homo sapiens (Human))
Università
Curated by ChEMBL
LigandPNGBDBM50109442(4-(3-(8-butyl-2-(furan-2-yl)-8H-pyrazolo[4,3-e][1,...)
Affinity DataKi: >1.00E+4nM. Assay description: Displacement of [3H]-DPCPX from human Adenosine A1 receptor expressed in CHO cells
In DepthDetails ArticlePubMed
TargetAdenosine receptor A2b(Homo sapiens (Human))
Università
Curated by ChEMBL
LigandPNGBDBM50109442(4-(3-(8-butyl-2-(furan-2-yl)-8H-pyrazolo[4,3-e][1,...)
Affinity DataKi: >1.00E+4nM. Assay description: Displacement of [3H]-DPCPX binding at human Adenosine A2B receptor expressed in HEK-293 cells
In DepthDetails ArticlePubMed