BDBM50109559 3-{4-[2-(Dibenzo[b,f][1,4]thiazepin-11-ylamino)-ethoxy]-phenyl}-2-ethoxy-propionic acid::CHEMBL167378
SMILES CCOC(Cc1ccc(OCCNC2=Nc3ccccc3Sc3ccccc23)cc1)C(O)=O
InChI Key InChIKey=HVDSIJKSGFPIAE-UHFFFAOYSA-N
Data  2 EC50
  Tab Delimited (TSV)   2D SDfile   Computed 3D by Vconf -m prep SDfile
Find this compound or compounds like it in BindingDB:
Activity Spreadsheet -- Enzyme Inhibition Constant Data from BindingDB
Found 2 hits for monomerid = 50109559
TargetPeroxisome proliferator-activated receptor alpha(Homo sapiens (Human))
Novo Nordisk
Curated by ChEMBL
LigandPNGBDBM50109559(3-{4-[2-(Dibenzo[b,f][1,4]thiazepin-11-ylamino)-et...)
Affinity DataEC50:  7.50E+3nM. Assay description: In vitro transactivation using receptor transactivation assay against hPPAR alpha
In DepthDetails ArticlePubMed
TargetPeroxisome proliferator-activated receptor gamma(Homo sapiens (Human))
Novo Nordisk
Curated by ChEMBL
LigandPNGBDBM50109559(3-{4-[2-(Dibenzo[b,f][1,4]thiazepin-11-ylamino)-et...)
Affinity DataEC50:  9.80E+3nM. Assay description: In vitro transactivation using receptor transactivation assay against hPPAR gamma
In DepthDetails ArticlePubMed