BDBM50110692 7-Oxa-bicyclo[2.2.1]heptane-2,3-dicarboxylic acid monoethyl ester::CHEMBL16701
SMILES CCOC(=O)C1[C@H]2CCC(O2)C1C(O)=O
InChI Key InChIKey=LVRCGKQYGUKJKS-QQJWGCFSSA-N
Data  2 IC50
  Tab Delimited (TSV)   2D SDfile   Computed 3D by Vconf -m prep SDfile
Find this compound or compounds like it in BindingDB:
Activity Spreadsheet -- Enzyme Inhibition Constant Data from BindingDB
Found 2 hits for monomerid = 50110692
TargetSerine/threonine-protein phosphatase 2A 55 kDa regulatory subunit B(Gallus gallus)
The University Of Newcastle
Curated by ChEMBL
LigandPNGBDBM50110692(7-Oxa-bicyclo[2.2.1]heptane-2,3-dicarboxylic acid ...)
Affinity DataIC50:  450nM. Assay description: Inhibition of Serine/threonine protein phosphatase 2A by anhydride modified Cantharidin analogues
In DepthDetails ArticlePubMed
TargetSerine/threonine-protein phosphatase PP1-gamma catalytic subunit(Homo sapiens (Human))
The University Of Newcastle
Curated by ChEMBL
LigandPNGBDBM50110692(7-Oxa-bicyclo[2.2.1]heptane-2,3-dicarboxylic acid ...)
Affinity DataIC50:  2.96E+3nM. Assay description: Inhibition of Serine/threonine protein phosphatase 1 by anhydride modified Cantharidin analogues
In DepthDetails ArticlePubMed