BDBM50110696 4,10-Dioxa-tricyclo[5.2.1.0*2,6*]decane-3,5-dione::CHEMBL17425
SMILES O=C1OC(=O)[C@H]2C3CC[C@@H](O3)C12
InChI Key InChIKey=JAABVEXCGCXWRR-IHKGAJJJSA-N
Data  2 IC50
  Tab Delimited (TSV)   2D SDfile   Computed 3D by Vconf -m prep SDfile
Find this compound or compounds like it in BindingDB:
Activity Spreadsheet -- Enzyme Inhibition Constant Data from BindingDB
Found 2 hits for monomerid = 50110696
TargetSerine/threonine-protein phosphatase 2A 55 kDa regulatory subunit B(Gallus gallus)
The University Of Newcastle
Curated by ChEMBL
LigandPNGBDBM50110696(4,10-Dioxa-tricyclo[5.2.1.0*2,6*]decane-3,5-dione ...)
Affinity DataIC50:  370nM. Assay description: Inhibition of Serine/threonine protein phosphatase 2A by anhydride modified Cantharidin analogues
In DepthDetails ArticlePubMed
TargetSerine/threonine-protein phosphatase PP1-gamma catalytic subunit(Homo sapiens (Human))
The University Of Newcastle
Curated by ChEMBL
LigandPNGBDBM50110696(4,10-Dioxa-tricyclo[5.2.1.0*2,6*]decane-3,5-dione ...)
Affinity DataIC50:  1.98E+3nM. Assay description: Inhibition of Serine/threonine protein phosphatase 1 by anhydride modified Cantharidin analogues
In DepthDetails ArticlePubMed