BDBM50110766 5-Biphenyl-4-yl-6-ethyl-pyrimidine-2,4-diamine::CHEMBL279986
SMILES CCc1nc(N)nc(N)c1-c1ccc(cc1)-c1ccccc1
InChI Key InChIKey=PMSUAONSGCBMTC-UHFFFAOYSA-N
Data  4 KI  1 IC50
  Tab Delimited (TSV)   2D SDfile   Computed 3D by Vconf -m prep SDfile
Find this compound or compounds like it in BindingDB:
Activity Spreadsheet -- Enzyme Inhibition Constant Data from BindingDB
Found 5 hits for monomerid = 50110766
TargetBifunctional dihydrofolate reductase-thymidylate synthase(Plasmodium falciparum (isolate K1 / Thailand))
Università
Curated by ChEMBL
LigandPNGBDBM50110766(5-Biphenyl-4-yl-6-ethyl-pyrimidine-2,4-diamine | C...)
Affinity DataKi:  90nM. Assay description: Inhibition constant against Plasmodium falciparum dihydrofolate reductaseChecked by Author
In DepthDetails ArticlePubMed
TargetBifunctional dihydrofolate reductase-thymidylate synthase(Plasmodium falciparum (isolate K1 / Thailand))
Università
Curated by ChEMBL
LigandPNGBDBM50110766(5-Biphenyl-4-yl-6-ethyl-pyrimidine-2,4-diamine | C...)
Affinity DataKi:  188nM. Assay description: Inhibition of the wild-type dihydrofolate reductase (DHFR)
In DepthDetails ArticlePubMed
TargetBifunctional dihydrofolate reductase-thymidylate synthase(Plasmodium falciparum (isolate K1 / Thailand))
Università
Curated by ChEMBL
LigandPNGBDBM50110766(5-Biphenyl-4-yl-6-ethyl-pyrimidine-2,4-diamine | C...)
Affinity DataKi:  421nM. Assay description: Inhibition of the S108N mutant of dihydrofolate reductase (DHFR)
In DepthDetails ArticlePubMed
TargetBifunctional dihydrofolate reductase-thymidylate synthase(Plasmodium falciparum (isolate K1 / Thailand))
Università
Curated by ChEMBL
LigandPNGBDBM50110766(5-Biphenyl-4-yl-6-ethyl-pyrimidine-2,4-diamine | C...)
Affinity DataKi:  730nM. Assay description: Inhibition of the C59R+S108N mutant of dihydrofolate reductase (DHFR)
In DepthDetails ArticlePubMed
TargetBifunctional dihydrofolate reductase-thymidylate synthase(Plasmodium falciparum (isolate K1 / Thailand))
Università
Curated by ChEMBL
LigandPNGBDBM50110766(5-Biphenyl-4-yl-6-ethyl-pyrimidine-2,4-diamine | C...)
Affinity DataIC50:  4.40E+3nM. Assay description: Antiplasmodial activity (IC50) against Plasmodium falciparum Clone with mutant enzyme C59R+S108N- pfDihydrofolate reductase (K1CB1)
In DepthDetails ArticlePubMed