BDBM50111669 (6S,8aS)-2-(Diphenyl-methanesulfonyl)-4-oxo-octahydro-pyrrolo[1,2-a]pyrazine-6-carboxylic acid (1-carbamimidoyl-piperidin-4-ylmethyl)-amide::CHEMBL17749
SMILES NC(=N)N1CCC(CNC(=O)[C@@H]2CC[C@H]3CN(CC(=O)N23)S(=O)(=O)C(c2ccccc2)c2ccccc2)CC1
InChI Key InChIKey=PDEMEVQMULWWFA-ZEQRLZLVSA-N
Data  1 KI
  Tab Delimited (TSV)   2D SDfile   Computed 3D by Vconf -m prep SDfile
Find this compound or compounds like it in BindingDB:
Activity Spreadsheet -- Enzyme Inhibition Constant Data from BindingDB
Found 1 hit for monomerid = 50111669
TargetCoagulation factor X(Homo sapiens (Human))
Shire Biochem
Curated by ChEMBL
LigandPNGBDBM50111669((6S,8aS)-2-(Diphenyl-methanesulfonyl)-4-oxo-octahy...)
Affinity DataKi:  9nM. Assay description: Inhibition of amidolytic activity of thrombin
In DepthDetails ArticlePubMed