BDBM50111673 (6S,8aS)-2-(Diphenyl-methanesulfonyl)-4-oxo-octahydro-pyrrolo[1,2-a]pyrazine-6-carboxylic acid 4-carbamimidoyl-benzylamide::CHEMBL275901
SMILES NC(=N)c1ccc(CNC(=O)[C@@H]2CC[C@H]3CN(CC(=O)N23)S(=O)(=O)C(c2ccccc2)c2ccccc2)cc1
InChI Key InChIKey=KXRPLCMLFFPZOI-DQEYMECFSA-N
Data  1 KI
  Tab Delimited (TSV)   2D SDfile   Computed 3D by Vconf -m prep SDfile
Find this compound or compounds like it in BindingDB:
Activity Spreadsheet -- Enzyme Inhibition Constant Data from BindingDB
Found 1 hit for monomerid = 50111673
TargetCoagulation factor X(Homo sapiens (Human))
Shire Biochem
Curated by ChEMBL
LigandPNGBDBM50111673((6S,8aS)-2-(Diphenyl-methanesulfonyl)-4-oxo-octahy...)
Affinity DataKi:  1nM. Assay description: Inhibition of amidolytic activity of thrombin
In DepthDetails ArticlePubMed