BDBM50112170 CHEMBL3608425
SMILES [O-]C(=O)C(F)(F)F.COc1ccc(CCC[N+]2(CCCc3ccccc3)CCCC(C2)NC(=O)c2nc(Cl)c(N)nc2N)cc1
InChI Key InChIKey=SUAYGUGXCREDFN-UHFFFAOYSA-N
Data  1 IC50
  Tab Delimited (TSV)   2D SDfile   Computed 3D by Vconf -m prep SDfile
Find this compound or compounds like it in BindingDB:
Activity Spreadsheet -- Enzyme Inhibition Constant Data from BindingDB
Found 1 hit for monomerid = 50112170
TargetAmiloride-sensitive sodium channel subunit alpha(Mus musculus)
Temple University School Of Pharmacy
Curated by ChEMBL
LigandPNGBDBM50112170(CHEMBL3608425)
Affinity DataIC50:  6nM. Assay description: Inhibition of ENaC in mouse M1 assessed as effect on trans epithelial electrical resistance by measuring short circuit currents by voltage-clamp base...
In DepthDetails ArticlePubMed