BDBM50112317 Atrial natriuretic peptide analogue::CHEMBL439465::[Ala7]mintANP
SMILES CC[C@H](C)[C@@H]1NC(=O)[C@@H](CCCNC(N)=N)NC(=O)[C@H](CC(O)=O)NC(=O)[C@@H](CCSC)NC(=O)[C@H](C)NC(=O)CNC(=O)CNC(=O)[C@@H](Cc2ccccc2)NC(=O)[C@H](Cc2cnc[nH]2)NC(=O)[C@H](CSSC[C@@H](NC(=O)[C@@H](CO)NC1=O)C(=O)N[C@@H](Cc1ccc(O)cc1)C(=O)N[C@@H](CCCNC(N)=N)C(N)=O)NC(=O)[C@@H](N)CCSC
InChI Key InChIKey=XVBDWCJXVBATEG-ZDLFFAIXSA-N
Data  1 EC50
  Tab Delimited (TSV)   2D SDfile   Computed 3D by Vconf -m prep SDfile
Find this compound or compounds like it in BindingDB:
Activity Spreadsheet -- Enzyme Inhibition Constant Data from BindingDB
Found 1 hit for monomerid = 50112317
TargetAtrial natriuretic peptide receptor 1(Homo sapiens (Human))
Institute For Bioorganic Research
Curated by ChEMBL
LigandPNGBDBM50112317(Atrial natriuretic peptide analogue | CHEMBL439465...)
Affinity DataEC50:  30nM. Assay description: Production of c-GMP in CHO cells expressing natriuretic peptide receptor (NPR-A) in response to compound
In DepthDetails ArticlePubMed