BDBM50112973 CHEMBL418579::Phosphoric acid mono-[4-((S)-2-acetylamino-2-{(4S,7S)-4-[(adamantan-1-ylmethyl)-carbamoyl]-6,10-dioxo-octahydro-pyridazino[1,2-a][1,2]diazepin-7-ylcarbamoyl}-ethyl)-phenyl] ester
SMILES CC(=O)N[C@@H](Cc1ccc(OP(O)(O)=O)cc1)C(=O)N[C@H]1CCC(=O)N2CCC[C@H](N2C1=O)C(=O)NCC12CC3CC(CC(C3)C1)C2
InChI Key InChIKey=FNZUOGWNBIQBRN-KKRMISSOSA-N
Data  1 IC50
  Tab Delimited (TSV)   2D SDfile   Computed 3D by Vconf -m prep SDfile
Find this compound or compounds like it in BindingDB:
Activity Spreadsheet -- Enzyme Inhibition Constant Data from BindingDB
Found 1 hit for monomerid = 50112973
TargetTyrosine-protein kinase Lck(Homo sapiens (Human))
Roche Products
Curated by ChEMBL
LigandPNGBDBM50112973(CHEMBL418579 | Phosphoric acid mono-[4-((S)-2-acet...)
Affinity DataIC50:  1.10E+3nM. Assay description: Inhibitory activity towards p56 Lck tyrosine kinase SH2 domain using scintillation proximity assay (SPA)
In DepthDetails ArticlePubMed