BDBM50113700 2-[1-(9-Isopropyl-6-phenylamino-9H-purin-2-yl)-piperidin-2-yl]-ethanol::CHEMBL308714
SMILES CC(C)n1cnc2c(Nc3ccccc3)nc(nc12)N1CCCCC1CCO
InChI Key InChIKey=PFWJNVZNGRRCDG-UHFFFAOYSA-N
Data  1 IC50
  Tab Delimited (TSV)   2D SDfile   Computed 3D by Vconf -m prep SDfile
Find this compound or compounds like it in BindingDB:
Activity Spreadsheet -- Enzyme Inhibition Constant Data from BindingDB
Found 1 hit for monomerid = 50113700
TargetCyclin-dependent kinase 1(Homo sapiens (Human))
Aventis Pharma Deutschland
Curated by ChEMBL
LigandPNGBDBM50113700(2-[1-(9-Isopropyl-6-phenylamino-9H-purin-2-yl)-pip...)
Affinity DataIC50:  1.30E+5nM. Assay description: Binding affinity to cyclin-dependent kinase 1 (CDK1)
In DepthDetails ArticlePubMed