BDBM50113769 2-[(4-Hydroxy-benzylidene)-amino]-propionic acid methyl ester::CHEMBL2367594
SMILES COC(=O)[C@H](C)\N=C\c1ccc(O)cc1
InChI Key InChIKey=MSNMBPDUCZAGAV-OTIXFSKASA-N
Data  1 IC50
  Tab Delimited (TSV)   2D SDfile   Computed 3D by Vconf -m prep SDfile
Find this compound or compounds like it in BindingDB:
Activity Spreadsheet -- Enzyme Inhibition Constant Data from BindingDB
Found 1 hit for monomerid = 50113769
TargetMacrophage migration inhibitory factor(Homo sapiens (Human))
Institute For Medical Research
Curated by ChEMBL
LigandPNGBDBM50113769(2-[(4-Hydroxy-benzylidene)-amino]-propionic acid m...)
Affinity DataIC50: >1.00E+5nM. Assay description: Inhibition of human macrophage migration inhibitory factor tautomerase (MIF) activity
In DepthDetails ArticlePubMed