BDBM50114120 (R)-4-((2R,6S,7S,8S,10R,12S)-10,13-Dimethyl-3,7,12-trioxo-hexadecahydro-cyclopenta[a]phenanthren-17-yl)-pentanoic acid [2-(5-sulfamoyl-[1,3,4]thiadiazol-2-ylcarbamoyl)-ethyl]-amide::CHEMBL3137762
SMILES [H][C@@]1(CC[C@@]2([H])[C@]3([H])C(=O)C[C@]4([H])CC(=O)CC[C@]4(C)[C@@]3([H])CC(=O)[C@]12C)[C@H](C)CCC(=O)NCCC(=O)Nc1nnc(s1)S(N)(=O)=O
InChI Key InChIKey=LSOOBIQEHGLKMZ-LKVBQOGYSA-N
Data  3 KI
  Tab Delimited (TSV)   2D SDfile   Computed 3D by Vconf -m prep SDfile
Find this compound or compounds like it in BindingDB:
Activity Spreadsheet -- Enzyme Inhibition Constant Data from BindingDB
Found 3 hits for monomerid = 50114120
TargetCarbonic anhydrase 1(Homo sapiens (Human))
Universit£
Curated by ChEMBL
LigandPNGBDBM50114120((R)-4-((2R,6S,7S,8S,10R,12S)-10,13-Dimethyl-3,7,12...)
Affinity DataKi:  1.10nM. Assay description: Inhibitory activity against human recombinant carbonic anhydrase I (CA1)
In DepthDetails ArticlePubMed
TargetCarbonic anhydrase 2(Homo sapiens (Human))
Universit£
Curated by ChEMBL
LigandPNGBDBM50114120((R)-4-((2R,6S,7S,8S,10R,12S)-10,13-Dimethyl-3,7,12...)
Affinity DataKi:  1.10nM. Assay description: Inhibitory activity against human recombinant carbonic anhydrase II (CA2)
In DepthDetails ArticlePubMed
TargetCarbonic anhydrase 4(Bos taurus (bovine))
Universit£
Curated by ChEMBL
LigandPNGBDBM50114120((R)-4-((2R,6S,7S,8S,10R,12S)-10,13-Dimethyl-3,7,12...)
Affinity DataKi:  1.10nM. Assay description: Inhibitory activity against bovine carbonic anhydrase IV (CA4), obtained from bovine lung microsomes
In DepthDetails ArticlePubMed