BDBM50114134 (R)-4-((8S,10S,12S,14R,15R,17S)-3,12-Di(R)-hydroxy-10,13-dimethyl-hexadecahydro-cyclopenta[a]phenanthren-17-yl)-pentanoic acid 2-sulfamoyl-benzothiazol-6-yl ester::CHEMBL3138419
SMILES [H][C@@]1(CC[C@@]2([H])[C@]3([H])[C@H](O)C[C@]4([H])C[C@H](O)CC[C@]4(C)[C@@]3([H])C[C@H](O)[C@]12C)[C@H](C)CCC(=O)Oc1ccc2nc(sc2c1)S(N)(=O)=O
InChI Key InChIKey=LVYBMFTZTFLNQZ-HQAAELTOSA-N
Data  3 KI
  Tab Delimited (TSV)   2D SDfile   Computed 3D by Vconf -m prep SDfile
Find this compound or compounds like it in BindingDB:
Activity Spreadsheet -- Enzyme Inhibition Constant Data from BindingDB
Found 3 hits for monomerid = 50114134
TargetCarbonic anhydrase 1(Homo sapiens (Human))
Universit£
Curated by ChEMBL
LigandPNGBDBM50114134((R)-4-((8S,10S,12S,14R,15R,17S)-3,12-Di(R)-hydroxy...)
Affinity DataKi:  4nM. Assay description: Inhibitory activity against human recombinant carbonic anhydrase I (CA1)
In DepthDetails ArticlePubMed
TargetCarbonic anhydrase 2(Homo sapiens (Human))
Universit£
Curated by ChEMBL
LigandPNGBDBM50114134((R)-4-((8S,10S,12S,14R,15R,17S)-3,12-Di(R)-hydroxy...)
Affinity DataKi:  4nM. Assay description: Inhibitory activity against human recombinant carbonic anhydrase II (CA2)
In DepthDetails ArticlePubMed
TargetCarbonic anhydrase 4(Bos taurus (bovine))
Universit£
Curated by ChEMBL
LigandPNGBDBM50114134((R)-4-((8S,10S,12S,14R,15R,17S)-3,12-Di(R)-hydroxy...)
Affinity DataKi:  4nM. Assay description: Inhibitory activity against bovine carbonic anhydrase IV (CA4), obtained from bovine lung microsomes
In DepthDetails ArticlePubMed