BDBM50114391 CHEMBL3604358
SMILES [H][C@]12C[C@@H](O)C=C[C@]11CCN(Cc3ccc(OC)c(O2)c13)C(=O)CCl
InChI Key InChIKey=OPNSABZBZCMSRL-YEWDVWPNSA-N
Data  1 IC50
  Tab Delimited (TSV)   2D SDfile   Computed 3D by Vconf -m prep SDfile
Find this compound or compounds like it in BindingDB:
Activity Spreadsheet -- Enzyme Inhibition Constant Data from BindingDB
Found 1 hit for monomerid = 50114391
TargetAcetylcholinesterase(Tetronarce californica (Pacific electric ray) (Tor...)
Medical University Of Sofia
Curated by ChEMBL
LigandPNGBDBM50114391(CHEMBL3604358)
Affinity DataIC50:  5.10E+4nM. Assay description: Inhibition of Torpedo californica AChE using ATCI substrate incubated for 30 mins by Ellman's method based spectrophotometry
In DepthDetails ArticlePubMed