BDBM50114774 2-Chloro-3-(2-pyridin-4-yl-vinyl)-5-(pyrrolidin-2-ylmethoxy)-pyridine::CHEMBL98923
SMILES Clc1ncc(OCC2CCCN2)cc1\C=C\c1ccncc1
InChI Key InChIKey=FRJSZKKMSWCQFS-ONEGZZNKSA-N
Data  1 KI
  Tab Delimited (TSV)   2D SDfile   Computed 3D by Vconf -m prep SDfile
Find this compound or compounds like it in BindingDB:
Activity Spreadsheet -- Enzyme Inhibition Constant Data from BindingDB
Found 1 hit for monomerid = 50114774
TargetNeuronal acetylcholine receptor subunit alpha-4/beta-2(Rattus norvegicus (Rat))
National Institute On Drug Abuse
Curated by ChEMBL
LigandPNGBDBM50114774(2-Chloro-3-(2-pyridin-4-yl-vinyl)-5-(pyrrolidin-2-...)
Affinity DataKi:  0.0150nM. Assay description: Binding affinity for nAChR with [3H]-imidacloprid in Drosophila
In DepthDetails ArticlePubMed