BDBM50116580 CHEMBL3609201
SMILES NS(=O)(=O)c1ccc(NC(=O)N2CCN(CC2)c2ccc(Cl)c(Cl)c2)cc1
InChI Key InChIKey=LBRAGTDNUYBWGU-UHFFFAOYSA-N
Data  4 KI
  Tab Delimited (TSV)   2D SDfile   Computed 3D by Vconf -m prep SDfile
Find this compound or compounds like it in BindingDB:
Activity Spreadsheet -- Enzyme Inhibition Constant Data from BindingDB
Found 4 hits for monomerid = 50116580
TargetCarbonic anhydrase 2(Homo sapiens (Human))
University Of Cagliari
Curated by ChEMBL
LigandPNGBDBM50116580(CHEMBL3609201)
Affinity DataKi:  5.40nM. Assay description: Inhibition of human carbonic anhydrase 2 preincubated for 15 mins by stopped flow CO2 hydration method
In DepthDetails ArticlePubMed
TargetCarbonic anhydrase 12(Homo sapiens (Human))
University Of Cagliari
Curated by ChEMBL
LigandPNGBDBM50116580(CHEMBL3609201)
Affinity DataKi:  128nM. Assay description: Inhibition of human carbonic anhydrase 12 preincubated for 15 mins by stopped flow CO2 hydration method
In DepthDetails ArticlePubMed
TargetCarbonic anhydrase 9(Homo sapiens (Human))
University Of Cagliari
Curated by ChEMBL
LigandPNGBDBM50116580(CHEMBL3609201)
Affinity DataKi:  268nM. Assay description: Inhibition of human carbonic anhydrase 9 preincubated for 15 mins by stopped flow CO2 hydration method
In DepthDetails ArticlePubMed
TargetCarbonic anhydrase 1(Homo sapiens (Human))
University Of Cagliari
Curated by ChEMBL
LigandPNGBDBM50116580(CHEMBL3609201)
Affinity DataKi:  9.49E+3nM. Assay description: Inhibition of human carbonic anhydrase 1 preincubated for 15 mins by stopped flow CO2 hydration method
In DepthDetails ArticlePubMed