BDBM50116750 CHEMBL306589::Thiophene-2-carboxylic acid {4-[1,4-dioxo-1,4-dihydro-2H-isoquinolin-(3Z)-ylidenemethyl]-phenyl}-amide
SMILES O=C(Nc1ccc(\C=C2/NC(=O)c3ccccc3C2=O)cc1)c1cccs1
InChI Key InChIKey=PJXJLXYMOVAMDR-ATVHPVEESA-N
Data  1 IC50
  Tab Delimited (TSV)   2D SDfile   Computed 3D by Vconf -m prep SDfile
Find this compound or compounds like it in BindingDB:
Activity Spreadsheet -- Enzyme Inhibition Constant Data from BindingDB
Found 1 hit for monomerid = 50116750
TargetPlasminogen activator inhibitor 1(Homo sapiens (Human))
Xenova
Curated by ChEMBL
LigandPNGBDBM50116750(CHEMBL306589 | Thiophene-2-carboxylic acid {4-[1,4...)
Affinity DataIC50:  4.00E+3nM. Assay description: Inhibitory concentration required against Plasminogen activator inhibitor 1.
In DepthDetails ArticlePubMed