BDBM50116953 6-Fluoro-1-[2-(4-methyl-[1,4]diazepan-1-yl)-ethyl]-1H-indole::CHEMBL309908
SMILES CN1CCCN(CCn2ccc3ccc(F)cc23)CC1
InChI Key InChIKey=ZQTAPOBZWWHWJX-UHFFFAOYSA-N
Data  1 KI
  Tab Delimited (TSV)   2D SDfile   Computed 3D by Vconf -m prep SDfile
Find this compound or compounds like it in BindingDB:
Activity Spreadsheet -- Enzyme Inhibition Constant Data from BindingDB
Found 1 hit for monomerid = 50116953
Target5-hydroxytryptamine receptor 7(Homo sapiens (Human))
Nps Pharmaceuticals
Curated by ChEMBL
LigandPNGBDBM50116953(6-Fluoro-1-[2-(4-methyl-[1,4]diazepan-1-yl)-ethyl]...)
Affinity DataKi:  288nM. Assay description: Binding affinity towards human 5-hydroxytryptamine 7 receptor on HEK293 cells using radioligand [3H]-LSD
In DepthDetails ArticlePubMed