BDBM50116957 6-Methoxy-1-[2-(4-methyl-[1,4]diazepan-1-yl)-ethyl]-1H-indole::CHEMBL81449
SMILES COc1ccc2ccn(CCN3CCCN(C)CC3)c2c1
InChI Key InChIKey=CMWFEICEOIMHLX-UHFFFAOYSA-N
Data  1 KI
  Tab Delimited (TSV)   2D SDfile   Computed 3D by Vconf -m prep SDfile
Find this compound or compounds like it in BindingDB:
Activity Spreadsheet -- Enzyme Inhibition Constant Data from BindingDB
Found 1 hit for monomerid = 50116957
Target5-hydroxytryptamine receptor 7(Homo sapiens (Human))
Nps Pharmaceuticals
Curated by ChEMBL
LigandPNGBDBM50116957(6-Methoxy-1-[2-(4-methyl-[1,4]diazepan-1-yl)-ethyl...)
Affinity DataKi:  1.57E+3nM. Assay description: Binding affinity towards human 5-hydroxytryptamine 7 receptor on HEK293 cells using radioligand [3H]-LSD
In DepthDetails ArticlePubMed