BDBM50116971 6-Bromo-1-[2-(4-cyclopropylmethyl-[1,4]diazepan-1-yl)-ethyl]-1H-indole::CHEMBL433134
SMILES Brc1ccc2ccn(CCN3CCCN(CC4CC4)CC3)c2c1
InChI Key InChIKey=BDJSZRPHRQUZJC-UHFFFAOYSA-N
Data  1 KI
  Tab Delimited (TSV)   2D SDfile   Computed 3D by Vconf -m prep SDfile
Find this compound or compounds like it in BindingDB:
Activity Spreadsheet -- Enzyme Inhibition Constant Data from BindingDB
Found 1 hit for monomerid = 50116971
Target5-hydroxytryptamine receptor 7(Homo sapiens (Human))
Nps Pharmaceuticals
Curated by ChEMBL
LigandPNGBDBM50116971(6-Bromo-1-[2-(4-cyclopropylmethyl-[1,4]diazepan-1-...)
Affinity DataKi:  9nM. Assay description: Binding affinity towards human 5-hydroxytryptamine 7 receptor on HEK293 cells using radioligand [3H]-LSD
In DepthDetails ArticlePubMed