BDBM50117104 CHEMBL3613133
SMILES COc1ccc(cc1)-c1nc(CSc2nc(N)c(C#N)c(-c3ccc(OC)cc3)c2C#N)cs1
InChI Key InChIKey=AIIYYCLQINCKBH-UHFFFAOYSA-N
Data  1 KI
  Tab Delimited (TSV)   2D SDfile   Computed 3D by Vconf -m prep SDfile
Find this compound or compounds like it in BindingDB:
Activity Spreadsheet -- Enzyme Inhibition Constant Data from BindingDB
Found 1 hit for monomerid = 50117104
TargetAdenosine receptor A1(Homo sapiens (Human))
Leiden University
Curated by ChEMBL
LigandPNGBDBM50117104(CHEMBL3613133)
Affinity DataKi:  9.30nM. Assay description: Displacement of [3H]DPCPX from human adenosine A1 receptor expressed in CHO cell membranes by competition association assay
In DepthDetails ArticlePubMed