BDBM50117106 CHEMBL3613131
SMILES COc1ccc(cc1)-c1c(C#N)c(N)nc(SCc2csc(n2)-c2ccccc2Cl)c1C#N
InChI Key InChIKey=PNURNWJQARRZDK-UHFFFAOYSA-N
Data  1 KI
  Tab Delimited (TSV)   2D SDfile   Computed 3D by Vconf -m prep SDfile
Find this compound or compounds like it in BindingDB:
Activity Spreadsheet -- Enzyme Inhibition Constant Data from BindingDB
Found 1 hit for monomerid = 50117106
TargetAdenosine receptor A1(Homo sapiens (Human))
Leiden University
Curated by ChEMBL
LigandPNGBDBM50117106(CHEMBL3613131)
Affinity DataKi:  11nM. Assay description: Displacement of [3H]DPCPX from human adenosine A1 receptor expressed in CHO cell membranes by competition association assay
In DepthDetails ArticlePubMed