BDBM50117640 CHEMBL3613639
SMILES CC(C)N1CCN(CC1)S(=O)(=O)c1ccc(NC(=O)c2ccc(cc2)S(F)(F)(F)(F)F)cc1
InChI Key InChIKey=LXVDSGFXMXYFGL-UHFFFAOYSA-N
Data  2 IC50
  Tab Delimited (TSV)   2D SDfile   Computed 3D by Vconf -m prep SDfile
Find this compound or compounds like it in BindingDB:
Activity Spreadsheet -- Enzyme Inhibition Constant Data from BindingDB
Found 2 hits for monomerid = 50117640
LigandPNGBDBM50117640(CHEMBL3613639)
Affinity DataIC50:  260nM. Assay description: Antagonist activity at human TRPV4 receptor expressed in HEK293 cells assessed as inhibition of EC80 of 4alpha-PDD-stimulated calcium flux after 10 m...
In DepthDetails ArticlePubMed
LigandPNGBDBM50117640(CHEMBL3613639)
Affinity DataIC50:  390nM. Assay description: Antagonist activity at rat TRPV4 receptor expressed in HEK293 cells assessed as inhibition of EC80 of 4alpha-PDD-stimulated calcium flux after 10 min...
In DepthDetails ArticlePubMed