BDBM50117653 CHEMBL3613635
SMILES CN(C)C1CCN(CC1)S(=O)(=O)c1ccc(NC(=O)c2ccc(cc2)C(F)(F)F)cc1
InChI Key InChIKey=SZBRLUOEGXOUIA-UHFFFAOYSA-N
Data  1 IC50
  Tab Delimited (TSV)   2D SDfile   Computed 3D by Vconf -m prep SDfile
Find this compound or compounds like it in BindingDB:
Activity Spreadsheet -- Enzyme Inhibition Constant Data from BindingDB
Found 1 hit for monomerid = 50117653
LigandPNGBDBM50117653(CHEMBL3613635)
Affinity DataIC50:  2.11E+3nM. Assay description: Antagonist activity at human TRPV4 receptor expressed in HEK293 cells assessed as inhibition of EC80 of 4alpha-PDD-stimulated calcium flux after 10 m...
In DepthDetails ArticlePubMed