BDBM50117658 CHEMBL220037
SMILES Fc1ccc(Nc2c(cnc3ccc(NCc4c[nH]cn4)cc23)C#N)cc1Cl
InChI Key InChIKey=HFOOHVUKODGHBP-UHFFFAOYSA-N
Data  1 IC50
  Tab Delimited (TSV)   2D SDfile   Computed 3D by Vconf -m prep SDfile
Find this compound or compounds like it in BindingDB:
Activity Spreadsheet -- Enzyme Inhibition Constant Data from BindingDB
Found 1 hit for monomerid = 50117658
TargetEpidermal growth factor receptor(Homo sapiens (Human))
Jazan University
Curated by ChEMBL
LigandPNGBDBM50117658(CHEMBL220037)
Affinity DataIC50:  30nM. Assay description: Inhibition of epidermal growth factor receptor kinase (unknown origin) using [33P]-ATP after 20 to 30 mins by radiometric assay
In DepthDetails ArticlePubMed