BDBM50117839 CHEMBL3613982
SMILES O=C(COc1ccc(cc1)S(=O)(=O)NCCc1ccccc1)NCc1ccccc1
InChI Key InChIKey=NWKRQKGWRQQSMU-UHFFFAOYSA-N
Data  1 IC50
  Tab Delimited (TSV)   2D SDfile   Computed 3D by Vconf -m prep SDfile
Find this compound or compounds like it in BindingDB:
Activity Spreadsheet -- Enzyme Inhibition Constant Data from BindingDB
Found 1 hit for monomerid = 50117839
TargetPhosphatidylcholine:ceramide cholinephosphotransferase 1(Homo sapiens (Human))
Fudan University
Curated by ChEMBL
LigandPNGBDBM50117839(CHEMBL3613982)
Affinity DataIC50:  2.31E+4nM. Assay description: Inhibition of sphingomyelin synthase-1 (unknown origin) expressed in HeLa cells using C6-NBD-Cer and DMPC as substrate after 2 hrs by fluorescent HPL...
In DepthDetails ArticlePubMed