BDBM50117846 CHEMBL3613988
SMILES Fc1ccc(NC(=O)COc2ccc(cc2)S(=O)(=O)NCCc2ccccc2)cc1
InChI Key InChIKey=KWJNXEMHHUQMNT-UHFFFAOYSA-N
Data  1 IC50
  Tab Delimited (TSV)   2D SDfile   Computed 3D by Vconf -m prep SDfile
Find this compound or compounds like it in BindingDB:
Activity Spreadsheet -- Enzyme Inhibition Constant Data from BindingDB
Found 1 hit for monomerid = 50117846
TargetPhosphatidylcholine:ceramide cholinephosphotransferase 1(Homo sapiens (Human))
Fudan University
Curated by ChEMBL
LigandPNGBDBM50117846(CHEMBL3613988)
Affinity DataIC50:  1.05E+4nM. Assay description: Inhibition of sphingomyelin synthase-1 (unknown origin) expressed in HeLa cells using C6-NBD-Cer and DMPC as substrate after 2 hrs by fluorescent HPL...
In DepthDetails ArticlePubMed