BDBM50117849 CHEMBL3613991
SMILES Cc1ccccc1NC(=O)COc1ccc(cc1)S(=O)(=O)NCCc1ccccc1
InChI Key InChIKey=HIHLXGDICDBJBK-UHFFFAOYSA-N
Data  1 IC50
  Tab Delimited (TSV)   2D SDfile   Computed 3D by Vconf -m prep SDfile
Find this compound or compounds like it in BindingDB:
Activity Spreadsheet -- Enzyme Inhibition Constant Data from BindingDB
Found 1 hit for monomerid = 50117849
TargetPhosphatidylcholine:ceramide cholinephosphotransferase 1(Homo sapiens (Human))
Fudan University
Curated by ChEMBL
LigandPNGBDBM50117849(CHEMBL3613991)
Affinity DataIC50: >1.00E+5nM. Assay description: Inhibition of sphingomyelin synthase-1 (unknown origin) expressed in HeLa cells using C6-NBD-Cer and DMPC as substrate after 2 hrs by fluorescent HPL...
In DepthDetails ArticlePubMed