BDBM50118122 CHEMBL3612325
SMILES FC(F)(F)c1cccc(NC(=O)Nc2ccc(Sc3ccnc4ccsc34)cc2)c1
InChI Key InChIKey=JNVNQHRESUUXEI-UHFFFAOYSA-N
Data  1 IC50
  Tab Delimited (TSV)   2D SDfile   Computed 3D by Vconf -m prep SDfile
Find this compound or compounds like it in BindingDB:
Activity Spreadsheet -- Enzyme Inhibition Constant Data from BindingDB
Found 1 hit for monomerid = 50118122
TargetVascular endothelial growth factor receptor 2(Homo sapiens (Human))
Universidade Do Minho
Curated by ChEMBL
LigandPNGBDBM50118122(CHEMBL3612325)
Affinity DataIC50:  988nM. Assay description: Inhibition of VEGFR2 (unknown origin) using Tyr1 peptide as substrate after 1 hr by FRET-based assay in presence of 10 uM ATP
In DepthDetails ArticlePubMed