BDBM50118331 3-(4-Benzo[1,3]dioxol-4-yl-piperazin-1-yl)-1-(5-fluoro-benzo[b]thiophen-3-yl)-propan-1-ol::CHEMBL337499
SMILES OC(CCN1CCN(CC1)c1cccc2OCOc12)c1csc2ccc(F)cc12
InChI Key InChIKey=ORGSQSTZLGJRRN-UHFFFAOYSA-N
Data  2 KI
  Tab Delimited (TSV)   2D SDfile   Computed 3D by Vconf -m prep SDfile
Find this compound or compounds like it in BindingDB:
Activity Spreadsheet -- Enzyme Inhibition Constant Data from BindingDB
Found 2 hits for monomerid = 50118331
Target5-hydroxytryptamine receptor 1A(Rattus norvegicus (rat))
Universidad De Navarra
Curated by ChEMBL
LigandPNGBDBM50118331(3-(4-Benzo[1,3]dioxol-4-yl-piperazin-1-yl)-1-(5-fl...)
Affinity DataKi:  9.40nM. Assay description: Binding affinity towards 5-hydroxytryptamine 1A receptor in rat frontal cortex homogenates
In DepthDetails ArticlePubMed
TargetSodium-dependent serotonin transporter(Rattus norvegicus (rat))
Universidad De Navarra
Curated by ChEMBL
LigandPNGBDBM50118331(3-(4-Benzo[1,3]dioxol-4-yl-piperazin-1-yl)-1-(5-fl...)
Affinity DataKi:  58nM. Assay description: Binding affinity towards Serotonin transporter (5-HTT) in rat frontal cortex homogenates
In DepthDetails ArticlePubMed